Target
EF-hand calcium-binding domain-containing protein 4B
Ligand
BDBM141428
Substrate
Meas. Tech.
In-Vitro Inhibition Assay
Temperature
310.15±n/a K
IC50
32.59±n/a nM
Comments
extracted
Citation
 Muthuppalaniappan, MViswanadha, SMerikapudi, GSVakkalanka, SK Modulators of calcium release-activated calcium channel US Patent  US8921364 Publication Date 12/30/2014 
Target
Name:
EF-hand calcium-binding domain-containing protein 4B
Synonyms:
CRACR2A EFC4B_HUMAN RAB46
Type:
Protein
Mol. Mass.:
45570.29
Organism:
Homo sapiens (Human)
Description:
Q9BSW2
Residue:
395
  
Inhibitor
Name:
BDBM141428
Synonyms:
US10668051, Compound Example 87 | US8921364, 87
Type:
Small organic molecule
Emp. Form.:
C20H13F6N3O
Mol. Mass.:
425.3271
SMILES:
Fc1cccc(C(=O)Nc2ccc(c(F)c2)-n2nc(cc2C2CC2)C(F)(F)F)c1F
: