Target
EF-hand calcium-binding domain-containing protein 4B
Ligand
BDBM141432
Substrate
Meas. Tech.
In-Vitro Inhibition Assay
Temperature
310.15±n/a K
IC50
159.1±n/a nM
Comments
extracted
Citation
 Muthuppalaniappan, MViswanadha, SMerikapudi, GSVakkalanka, SK Modulators of calcium release-activated calcium channel US Patent  US8921364 Publication Date 12/30/2014 
Target
Name:
EF-hand calcium-binding domain-containing protein 4B
Synonyms:
CRACR2A EFC4B_HUMAN RAB46
Type:
Protein
Mol. Mass.:
45570.29
Organism:
Homo sapiens (Human)
Description:
Q9BSW2
Residue:
395
  
Inhibitor
Name:
BDBM141432
Synonyms:
US10668051, Compound Example 91 | US8921364, 91
Type:
Small organic molecule
Emp. Form.:
C19H13F5N4O
Mol. Mass.:
408.3247
SMILES:
Fc1cnccc1C(=O)Nc1ccc(c(F)c1)-n1nc(cc1C1CC1)C(F)(F)F
: