Target
Kynurenine/alpha-aminoadipate aminotransferase, mitochondrial
Ligand
BDBM107724
Substrate
Meas. Tech.
Inhibition Spectra Assay
Temperature
310.15±n/a K
IC50
36±n/a nM
Comments
extracted
Citation
 Dounay, ABMcAllister, LAParikh, VDRong, SVerhoest, PR KAT II inhibitors US Patent  US8933095 Publication Date 1/13/2015 
Target
Name:
Kynurenine/alpha-aminoadipate aminotransferase, mitochondrial
Synonyms:
2-aminoadipate aminotransferase AADAT Alpha-aminoadipate aminotransferase KAT2 Kynurenine aminotransferase II Kynurenine--oxoglutarate aminotransferase II Kynurenine--oxoglutarate transaminase II
Type:
Enzyme
Mol. Mass.:
47353.09
Organism:
Homo sapiens (Human)
Description:
Q8N5Z0
Residue:
425
  
Inhibitor
Name:
BDBM107724
Synonyms:
US8933095, 8
Type:
Small organic molecule
Emp. Form.:
C17H16N4O2
Mol. Mass.:
308.3345
SMILES:
N[C@H]1Cc2cn(Cc3cccc4ccccc34)nc2N(O)C1=O
: