Target
Apoptosis regulator Bcl-2
Ligand
BDBM142755
Substrate
Meas. Tech.
Fluorescence Polarization Assay
Temperature
298.15±n/a K
IC50
2170±n/a nM
Comments
extracted
Citation
 Pellecchia, MWei, J Apogossypolone derivatives as anticancer agents US Patent  US8937193 Publication Date 1/20/2015 
Target
Name:
Apoptosis regulator Bcl-2
Synonyms:
Apoptosis regulator Bcl-2 Protein BCL-2 BCL2_HUMAN | Bcl-2 Protein
Type:
Homodimer or heterodimer
Mol. Mass.:
26269.11
Organism:
Homo sapiens (Human)
Description:
P10415
Residue:
239
  
Inhibitor
Name:
BDBM142755
Synonyms:
US8937193, 6g
Type:
Small organic molecule
Emp. Form.:
C40H34O8
Mol. Mass.:
642.6932
SMILES:
Cc1c(-c2c(C)c(=O)c3c(CCCc4ccccc4)c(O)c(O)cc3c2=O)c(=O)c2cc(O)c(O)c(CCCc3ccccc3)c2c1=O
: