Target
Bcl-2-like protein 1
Ligand
BDBM142745
Substrate
Meas. Tech.
ITC Assay
Kd
2800±n/a nM
Citation
 Pellecchia, MWei, J Apogossypolone derivatives as anticancer agents US Patent  US8937193 Publication Date 1/20/2015 
Target
Name:
Bcl-2-like protein 1
Synonyms:
Anti-apoptotic Bcl-2 protein Apoptosis regulator Bcl-X BCL2-like 1 isoform 1 BCL2L1 Bcl-2-like protein 1 (Bcl-XL) Bcl-xL/Bcl-2-binding component 3 Bcl2-antagonist of cell death (BAD)
Type:
Mitochondrion membrane; Single-pass membrane protein
Mol. Mass.:
26039.60
Organism:
Homo sapiens (Human)
Description:
Residue:
233
  
Inhibitor
Name:
BDBM142745
Synonyms:
US8937193, 6a
Type:
Small organic molecule
Emp. Form.:
C28H26O8
Mol. Mass.:
490.5012
SMILES:
CC(C)c1c(O)c(O)cc2c1c(=O)c(C)c(-c1c(C)c(=O)c3c(C(C)C)c(O)c(O)cc3c1=O)c2=O
: