Target
Bcl-2-like protein 1
Ligand
BDBM142756
Substrate
Meas. Tech.
ITC Assay
Kd
450±n/a nM
Citation
 Pellecchia, MWei, J Apogossypolone derivatives as anticancer agents US Patent  US8937193 Publication Date 1/20/2015 
Target
Name:
Bcl-2-like protein 1
Synonyms:
Anti-apoptotic Bcl-2 protein Apoptosis regulator Bcl-X BCL2-like 1 isoform 1 BCL2L1 Bcl-2-like protein 1 (Bcl-XL) Bcl-xL/Bcl-2-binding component 3 Bcl2-antagonist of cell death (BAD)
Type:
Mitochondrion membrane; Single-pass membrane protein
Mol. Mass.:
26039.60
Organism:
Homo sapiens (Human)
Description:
Residue:
233
  
Inhibitor
Name:
BDBM142756
Synonyms:
US8937193, 6i
Type:
Small organic molecule
Emp. Form.:
C36H26O8
Mol. Mass.:
586.5868
SMILES:
Cc1c(-c2c(C)c(=O)c3c(Cc4ccccc4)c(O)c(O)cc3c2=O)c(=O)c2cc(O)c(O)c(Cc3ccccc3)c2c1=O
: