Target
Tyrosine-protein kinase JAK3
Ligand
BDBM100351
Substrate
Meas. Tech.
Ambit KinomeScan Assay
Kd
4.1±n/a nM
Citation
 Bauer, SMPandey, A Inhibitors of protein kinases US Patent  US8937070 Publication Date 1/20/2015 
Target
Name:
Tyrosine-protein kinase JAK3
Synonyms:
JAK-3 JAK3_HUMAN Janus kinase 3 (JAK3) L-JAK | Leukocyte janus kinase
Type:
Protein
Mol. Mass.:
125111.08
Organism:
Homo sapiens (Human)
Description:
P52333
Residue:
1124
  
Inhibitor
Name:
BDBM100351
Synonyms:
US10533001, Example Table 9a.4 US8501944, 373 US9868729, Example 254
Type:
Small organic molecule
Emp. Form.:
C20H25N7O2
Mol. Mass.:
395.4582
SMILES:
NC(=O)[C@@H]1CCCN(C1)c1ccc(Nc2ncc(C(N)=O)c(NC3CC3)n2)cc1
: