Target
Tyrosine-protein kinase BTK
Ligand
BDBM143179
Substrate
Meas. Tech.
Caliper-Based Kinase Assay
Temperature
298.15±n/a K
IC50
0.3±n/a nM
Comments
extracted
Citation
 Owens, TVerner, E Pyrazolopyrimidine compounds as kinase inhibitors US Patent  US8940744 Publication Date 1/27/2015 
Target
Name:
Tyrosine-protein kinase BTK
Synonyms:
AGMX1 Agammaglobulinaemia tyrosine kinase B cell progenitor kinase BPK BTK_HUMAN Tyrosine Kinase BTK Tyrosine-protein kinase BTK (BTK)
Type:
Enzyme
Mol. Mass.:
76289.95
Organism:
Homo sapiens (Human)
Description:
Q06187
Residue:
659
  
Inhibitor
Name:
BDBM143179
Synonyms:
US8940744, 4 | US9266895, 4
Type:
Small organic molecule
Emp. Form.:
C34H38FN9O2
Mol. Mass.:
623.723
SMILES:
CN1CCN(CC1)C(C)(C)C=C([N+]#[C-])C(=O)N1CCC[C@H](C1)n1nc(-c2ccc(Oc3ccccc3)cc2F)c2c(N)ncnc12
: