Target
Serine/threonine-protein kinase TBK1
Ligand
BDBM144149
Substrate
Meas. Tech.
Flashplate Assay
pH
7.5±n/a
Temperature
303.15±n/a K
IC50
290±n/a nM
Comments
extracted
Citation
 Hoelzemann, GDorsch, DEggenweiler, H Benzonitrile derivatives as kinase inhibitors US Patent  US8969335 Publication Date 3/3/2015 
Target
Name:
Serine/threonine-protein kinase TBK1
Synonyms:
NAK Protein cereblon/Serine/threonine-protein kinase TBK1 TANK-binding kinase 1 (TBK-1) TBK1 | TBK1_HUMAN
Type:
protein
Mol. Mass.:
83645.20
Organism:
Homo sapiens (Human)
Description:
Q9UHD2
Residue:
729
  
Inhibitor
Name:
BDBM144149
Synonyms:
US8969335, A86
Type:
Small organic molecule
Emp. Form.:
C27H26N4O3
Mol. Mass.:
454.5203
SMILES:
N#Cc1cc(ccc1OC1CCOCC1)-c1ccnc(Nc2cc(ccn2)C2=CCCCO2)c1
: