Target
Receptor-type tyrosine-protein kinase FLT3
Ligand
BDBM144327
Substrate
Meas. Tech.
Inhibition Assay
IC50
0.39±n/a nM
Citation
 Shimada, IKurosawa, KMatsuya, TIikubo, KKondoh, YKamikawa, ATomiyama, HIwai, Y Diamino heterocyclic carboxamide compound US Patent  US8969336 Publication Date 3/3/2015 
Target
Name:
Receptor-type tyrosine-protein kinase FLT3
Synonyms:
CD135 FL cytokine receptor FLK2 FLT3 Fetal liver kinase-2 Fms-like tyrosine kinase 3 (Flt-3) STK-1 Stem cell tyrosine kinase 1
Type:
Enzyme
Mol. Mass.:
112888.62
Organism:
Homo sapiens (Human)
Description:
P36888
Residue:
993
  
Inhibitor
Name:
BDBM144327
Synonyms:
US8969336, 571
Type:
Small organic molecule
Emp. Form.:
C31H48N8O2
Mol. Mass.:
564.7652
SMILES:
CCc1nc(C(N)=O)c(Nc2ccc(N3CCC(CC3)N3CCN(C)CC3)c(C)c2)nc1N[C@H]1CC[C@@](C)(O)CC1
: