Target
Tyrosine-protein kinase SYK
Ligand
BDBM144560
Substrate
Meas. Tech.
Kinase Glo Luminescence Kinase Assay
IC50
0.1±n/a nM
Citation
 Hoffmann, MDahmann, GFiegen, DHandschuh, SKlicic, JLinz, GSchaenzle, GSchnapp, AEast, SPMazanetz, MPScott, RJWalker, E Substituted naphthyridines and their use as medicaments US Patent  US8969568 Publication Date 3/3/2015 
Target
Name:
Tyrosine-protein kinase SYK
Synonyms:
KSYK_HUMAN Spleen Tyrosine Kinase Tyrosine-protein kinase SYK (Syk)
Type:
Enzyme
Mol. Mass.:
72079.99
Organism:
Homo sapiens (Human)
Description:
P43405
Residue:
635
  
Inhibitor
Name:
BDBM144560
Synonyms:
US8969568, 113
Type:
Small organic molecule
Emp. Form.:
C25H29N3O4
Mol. Mass.:
435.5155
SMILES:
CC[C@@H](Oc1nc(cc2ncccc12)-c1ccc(OC(C)C)c(OC)c1)[C@H]1CNC(=O)C1
: