Target
Vascular endothelial growth factor receptor 2
Ligand
BDBM4882
Substrate
poly(E:Y)
Meas. Tech.
Tyrosine Kinase Assay
pH
7.5±n/a
Temperature
295.15±n/a K
IC50
20±n/a nM
Citation
 Sun, LTran, NLiang, CHubbard, STang, FLipson, KSchreck, RZhou, YMcMahon, GTang, C Identification of substituted 3-[(4,5,6, 7-tetrahydro-1H-indol-2-yl)methylene]-1,3-dihydroindol-2-ones as growth factor receptor inhibitors for VEGF-R2 (Flk-1/KDR), FGF-R1, and PDGF-Rbeta tyrosine kinases. J Med Chem 43:2655-63 (2000)  
Target
Name:
Vascular endothelial growth factor receptor 2
Synonyms:
CD_antigen=CD309 Fetal liver kinase 1 (FLK-1) KDR Protein-tyrosine kinase receptor Flk-1 VEGFR-2 VEGFR2 Vascular Endothelial Growth Factor Receptor Kinase 2 Vascular endothelial growth factor receptor 2 (KDR) Vascular endothelial growth factor receptor 2 (VEGFR2) Vascular endothelial growth factor receptor-2 (VEGFR-2)
Type:
Receptor Tyrosine Kinase
Mol. Mass.:
151510.97
Organism:
Homo sapiens (Human)
Description:
P35968
Residue:
1356
  
Inhibitor
Name:
BDBM4882
Synonyms:
(Z)-3-[(3-(2-Carboxyethyl)-4-methylpyrrol-2-yl)methylidenyl]indolin-2-one CHEMBL89363 SU5402
Type:
Small organic molecule
Emp. Form.:
C17H16N2O3
Mol. Mass.:
296.3205
SMILES:
Cc1c[nH]c(\C=C2/C(=O)Nc3ccccc23)c1CCC(O)=O
:
Substrate
Name:
poly(E:Y)
Synonyms:
Type:
Random Polymer
Mol. Mass.:
358.43
Organism:
Description:
a polyGlu-Tyr peptide (4:1)(Sigma P-0275). 10 uM ATP as co-substrate.
Residue:
3
NA