Target
Fibroblast growth factor receptor 1
Ligand
BDBM4882
Substrate
poly(E:Y)
Meas. Tech.
Tyrosine Kinase Assay
IC50
30±n/a nM
Citation
 Sun, LTran, NLiang, CHubbard, STang, FLipson, KSchreck, RZhou, YMcMahon, GTang, C Identification of substituted 3-[(4,5,6, 7-tetrahydro-1H-indol-2-yl)methylene]-1,3-dihydroindol-2-ones as growth factor receptor inhibitors for VEGF-R2 (Flk-1/KDR), FGF-R1, and PDGF-Rbeta tyrosine kinases. J Med Chem 43:2655-63 (2000)  
Target
Name:
Fibroblast growth factor receptor 1
Synonyms:
BFGFR Basic fibroblast growth factor receptor 1 (FGFR1) CEK FGFR-1 FGFR-1, (FL) FGFR1_HUMAN FLT2 Fibroblast growth factor receptor 1 (FGFR-1) Fms-like tyrosine kinase 2 N-sam bFGF-R | c-fgr
Type:
Receptor
Mol. Mass.:
91861.70
Organism:
Homo sapiens (Human)
Description:
P11362
Residue:
822
  
Inhibitor
Name:
BDBM4882
Synonyms:
(Z)-3-[(3-(2-Carboxyethyl)-4-methylpyrrol-2-yl)methylidenyl]indolin-2-one CHEMBL89363 SU5402
Type:
Small organic molecule
Emp. Form.:
C17H16N2O3
Mol. Mass.:
296.3205
SMILES:
Cc1c[nH]c(\C=C2/C(=O)Nc3ccccc23)c1CCC(O)=O
:
Substrate
Name:
poly(E:Y)
Synonyms:
Type:
Random Polymer
Mol. Mass.:
358.43
Organism:
Description:
a polyGlu-Tyr peptide (4:1)(Sigma P-0275). 10 uM ATP as co-substrate.
Residue:
3
NA