Target
Steroid 17-alpha-hydroxylase/17,20 lyase
Ligand
BDBM144614
Substrate
Meas. Tech.
SPA Assay
pH
7.2±n/a
Temperature
298.15±n/a K
IC50
1.1±n/a nM
Comments
extracted
Citation
 Balog, JAHuang, A Substituted bicyclic heteroaryl compounds US Patent  US8969586 Publication Date 3/3/2015 
Target
Name:
Steroid 17-alpha-hydroxylase/17,20 lyase
Synonyms:
CP17A_HUMAN CYP17A1 Cytochrome P450 17A1 Cytochrome P450 C17 (CYP17) Cytochrome P450-C17 P450-C17 Steroid 17-alpha-Monooxygenase (CYP17) Steroid 17-alpha-monooxygenase | cytochrome P450 monooxygenase 17 alpha hydroxylase/17,20-lyase (CYP17)
Type:
Enzyme
Mol. Mass.:
57382.42
Organism:
Homo sapiens (Human)
Description:
E.coli expressing human CYP17
Residue:
508
  
Inhibitor
Name:
BDBM144614
Synonyms:
US8969586, 1 | US9598436, 1
Type:
Small organic molecule
Emp. Form.:
C19H14N2O
Mol. Mass.:
286.3273
SMILES:
Cc1ccncc1-c1cccc2c(noc12)-c1ccccc1
: