Target
cAMP and cAMP-inhibited cGMP 3',5'-cyclic phosphodiesterase 10A
Ligand
BDBM144724
Substrate
Meas. Tech.
IMAP TR-FRET Assay
Temperature
298.15±n/a K
IC50
436±n/a nM
Comments
extracted
Citation
 Allen, JRFrohn, MJHarrington, PEHu, EPickrell, AJRzasa, RMSham, KK Heteroaryloxycarbocyclyl compounds as PDE10 inhibitors US Patent  US8952037 Publication Date 2/10/2015 
Target
Name:
cAMP and cAMP-inhibited cGMP 3',5'-cyclic phosphodiesterase 10A
Synonyms:
3',5'-cyclic phosphodiesterase PDE10_HUMAN Phosphodiesterase 10A
Type:
Protein
Mol. Mass.:
88412.52
Organism:
Homo sapiens (Human)
Description:
Q9Y233
Residue:
779
  
Inhibitor
Name:
BDBM144724
Synonyms:
US8952037, 108
Type:
Small organic molecule
Emp. Form.:
C20H22F3N3O2
Mol. Mass.:
393.4028
SMILES:
FC(F)(F)c1ccc(N[C@H]2C[C@@H](C2)Oc2ncccc2C2CCOCC2)nc1
: