Target
Apoptosis regulator Bcl-2
Ligand
BDBM145177
Substrate
Meas. Tech.
Time Resolved-Fluorescence Resonance Energy Transfer (TR-FRET) Assay
Temperature
298.15±n/a K
Ki
<0.01±n/a nM
Comments
extracted
Citation
 Ding, HDoherty, GAElmore, SWHexamer, LKunzer, ARPark, CSong, XSouers, AJSullivan, GMTao, ZWang, LWendt, MDCzabotar, PELessene, GLColman, PM Apoptosis-inducing agents for the treatment of cancer and immune and autoimmune diseases US Patent  US8952157 Publication Date 2/10/2015 
Target
Name:
Apoptosis regulator Bcl-2
Synonyms:
Apoptosis regulator Bcl-2 Protein BCL-2 BCL2_HUMAN | Bcl-2 Protein
Type:
Homodimer or heterodimer
Mol. Mass.:
26269.11
Organism:
Homo sapiens (Human)
Description:
P10415
Residue:
239
  
Inhibitor
Name:
BDBM145177
Synonyms:
US8952157, 368 | US9303025, 368
Type:
Small organic molecule
Emp. Form.:
C46H52ClN7O8S
Mol. Mass.:
898.465
SMILES:
Cn1c2c(Oc3cc(ccc3C(=O)NS(=O)(=O)c3ccc(NCC4CCOCC4)c(c3)[N+]([O-])=O)N3CCN(CC4=C(CC(C)(C)CC4)c4ccc(Cl)cc4)CC3)cccc2[nH]c1=O
: