Target
Isocitrate dehydrogenase [NADP] cytoplasmic
Ligand
BDBM146103
Substrate
Meas. Tech.
LC-MS Biochemical Assay
pH
7.4±n/a
Temperature
298.15±n/a K
IC50
1061±n/a nM
Comments
extracted
Citation
 Caferro, TRCho, YSCostales, AQLei, HLenoir, FLevell, JRLiu, GPalermo, MGPfister, KBSendzik, MShafer, CShultz, MDSmith, TSutton, JCToure, BYang, FZhao, Q 3-pyrimidin-4-yl-oxazolidin-2-ones as inhibitors of mutant IDH US Patent  US8957068 Publication Date 2/17/2015 
Target
Name:
Isocitrate dehydrogenase [NADP] cytoplasmic
Synonyms:
Cytosolic NADP-isocitrate dehydrogenase IDH1 IDP Isocitrate dehydrogenase 1 (IDH1) Oxalosuccinate decarboxylase | PICD
Type:
Protein
Mol. Mass.:
46661.29
Organism:
Homo sapiens (Human)
Description:
O75874
Residue:
414
  
Inhibitor
Name:
BDBM146103
Synonyms:
US8957068, 138
Type:
Small organic molecule
Emp. Form.:
C16H26N4O2
Mol. Mass.:
306.4032
SMILES:
CC(C)C[C@H](C)Nc1nccc(n1)N1[C@H](COC1=O)C(C)C
: