Target
Isocitrate dehydrogenase [NADP] cytoplasmic
Ligand
BDBM146157
Substrate
Meas. Tech.
LC-MS Biochemical Assay
pH
7.4±n/a
Temperature
298.15±n/a K
IC50
88±n/a nM
Comments
extracted
Citation
 Caferro, TRCho, YSCostales, AQLei, HLenoir, FLevell, JRLiu, GPalermo, MGPfister, KBSendzik, MShafer, CShultz, MDSmith, TSutton, JCToure, BYang, FZhao, Q 3-pyrimidin-4-yl-oxazolidin-2-ones as inhibitors of mutant IDH US Patent  US8957068 Publication Date 2/17/2015 
Target
Name:
Isocitrate dehydrogenase [NADP] cytoplasmic
Synonyms:
Cytosolic NADP-isocitrate dehydrogenase IDH1 IDP Isocitrate dehydrogenase 1 (IDH1) Oxalosuccinate decarboxylase | PICD
Type:
Protein
Mol. Mass.:
46661.29
Organism:
Homo sapiens (Human)
Description:
O75874
Residue:
414
  
Inhibitor
Name:
BDBM146157
Synonyms:
US8957068, 209
Type:
Small organic molecule
Emp. Form.:
C25H33N5O3
Mol. Mass.:
451.5612
SMILES:
CC(C)[C@H]1COC(=O)N1c1ccnc(N[C@@H](C)c2ccc(NC(=O)C3CCCCC3)cc2)n1
: