Target
Tyrosine-protein kinase JAK1
Ligand
BDBM147824
Substrate
Meas. Tech.
HTRF Assay
IC50
0.25±n/a nM
Citation
 Brubaker, JDinsmore, CHoffman, DMJung, JLiu, DPeterson, SSiu, TTorres, LEZhang, HWei, ZShi, F Cycloalkylnitrile pyrazole carboxamides as janus kinase inhibitors US Patent  US8962608 Publication Date 2/24/2015 
Target
Name:
Tyrosine-protein kinase JAK1
Synonyms:
JAK-1 JAK1A JAK1_HUMAN Janus kinase 1 (JAK1) | Janus kinase 1 JAK1
Type:
Protein
Mol. Mass.:
133293.73
Organism:
Homo sapiens (Human)
Description:
P23458
Residue:
1154
  
Inhibitor
Name:
BDBM147824
Synonyms:
US8962608, 28-145
Type:
Small organic molecule
Emp. Form.:
C24H30N6O3S
Mol. Mass.:
482.598
SMILES:
CS(=O)(=O)c1ccc(Nc2nn(cc2C(N)=O)[C@H]2CC[C@H](C[C@@H]2C#N)N2CC3(CCC3)C2)cc1
: