Target
Serine/threonine-protein kinase TBK1
Ligand
BDBM148080
Substrate
Meas. Tech.
Time-Resolved Fluorescence-based Lanthascreen Assay
pH
7.5±n/a
IC50
<30±n/a nM
Comments
extracted
Citation
 Perrior, TRNewton, GKStewart, MRAqil, R Pyrimidine compounds as inhibitors of protein kinases IKK epsilon and/or TBK-1, processes for their preparation, and pharmaceutical compositions containing them US Patent  US8962609 Publication Date 2/24/2015 
Target
Name:
Serine/threonine-protein kinase TBK1
Synonyms:
NAK Protein cereblon/Serine/threonine-protein kinase TBK1 TANK-binding kinase 1 (TBK-1) TBK1 | TBK1_HUMAN
Type:
protein
Mol. Mass.:
83645.20
Organism:
Homo sapiens (Human)
Description:
Q9UHD2
Residue:
729
  
Inhibitor
Name:
BDBM148080
Synonyms:
US8962609, DMX-14
Type:
Small organic molecule
Emp. Form.:
C23H20N6O
Mol. Mass.:
396.4445
SMILES:
O=C1Cc2cc(Nc3nccc(n3)-c3ccc(N4CCCC4)c(c3)C#N)ccc2N1
: