Target
RAC-alpha serine/threonine-protein kinase
Ligand
BDBM108437
Substrate
Meas. Tech.
Thermal Shift Assay
Kd
1.1±n/a nM
Citation
 Ashwell, MABrassard, CFilikov, AHill, JKoerner, SLapierre, JLiu, YNamdev, NNicewonger, RPalma, RTandon, MVensel, DMatsuda, AIimura, SYoshida, KYamazaki, TKitamura, TIsoyama, T Substituted imidazopyridinyl-aminopyridine compounds US Patent  US8962619 Publication Date 2/24/2015 
Target
Name:
RAC-alpha serine/threonine-protein kinase
Synonyms:
AKT phosphorylation (p-AKT) AKT1/PPP1CA C-AKT PKB alpha Protein kinase B Protein kinase B (Akt 1) Protein kinase B alpha Proto-oncogene Akt (Akt1) Proto-oncogene c-Akt (AKT1) RAC-PK-alpha RAC-alpha serine/threonine-protein kinase (AKT1) | RAC-alpha serine/threonine-protein kinase (pAKT)
Type:
Enzyme
Mol. Mass.:
55681.25
Organism:
Homo sapiens (Human)
Description:
P31749
Residue:
480
  
Inhibitor
Name:
BDBM108437
Synonyms:
US8609688, 15
Type:
Small organic molecule
Emp. Form.:
C35H38N8O
Mol. Mass.:
586.7292
SMILES:
CC(C)C(=O)N1CCN(CC1)c1cccc(c1)-c1ccc2nc(-c3cccnc3N)n(-c3ccc(cc3)C3(N)CCC3)c2n1
: