Target
Vasopressin V2 receptor
Ligand
BDBM192451
Substrate
Meas. Tech.
Cellular In Vitro Assay
Temperature
310.15±n/a K
IC50
1.50±n/a nM
Comments
extracted
Citation
 Fürstner, CKeldenich, JDelbeck, MKolkhof, PKretschmer, APluschkell, IPook, ESchmeck, CTrübel, H Bisaryl-bonded aryltriazolones and use thereof US Patent  US9687476 Publication Date 6/27/2017 
Target
Name:
Vasopressin V2 receptor
Synonyms:
ADHR AVPR2 DIR Renal-type arginine vasopressin receptor V2R_HUMAN Vasopressin V2 receptor | Vasopressin receptor
Type:
Receptor
Mol. Mass.:
40295.28
Organism:
Homo sapiens (Human)
Description:
P30518
Residue:
371
  
Inhibitor
Name:
BDBM192451
Synonyms:
US9187466, 49 | US9687476, 49
Type:
Small organic molecule
Emp. Form.:
C21H17Cl2F3N6O2
Mol. Mass.:
513.3
SMILES:
O[C@@H](Cn1c(nn(Cc2nnc(Cc3ccccc3Cl)[nH]2)c1=O)-c1ccc(Cl)cc1)C(F)(F)F
: