Target
Mu-type opioid receptor
Ligand
BDBM148983
Substrate
Meas. Tech.
Competitive Displacement Assay
pH
7.5±n/a
Temperature
298.15±n/a K
Ki
1.7±n/a nM
Comments
extracted
Citation
 Blumberg, LCArnelle, D Peripherally acting opioid compounds US Patent  US8962646 Publication Date 2/24/2015 
Target
Name:
Mu-type opioid receptor
Synonyms:
M-OR-1 MOR-1 MUOR1 Mu opiate receptor OPRM1 hMOP | mu-type opioid receptor isoform MOR-1
Type:
G Protein-Coupled Receptor (GPCR)
Mol. Mass.:
44789.51
Organism:
Homo sapiens (Human)
Description:
P35372
Residue:
400
  
Inhibitor
Name:
BDBM148983
Synonyms:
US8962646, 5
Type:
Small organic molecule
Emp. Form.:
C30H32N4O6
Mol. Mass.:
544.5983
SMILES:
CN1CC[C@]23CC(=O)CC[C@@]2(O)[C@H]1Cc1ccc(C(=O)NCCc2ccc(cc2)-c2c[nH]c(=O)[nH]c2=O)c(O)c31
: