Target
Vascular endothelial growth factor receptor 2
Ligand
BDBM149703
Substrate
Meas. Tech.
Kinase Assay
pH
7±n/a
Temperature
298.15±n/a K
Kd
6.3±n/a nM
Comments
extracted
Citation
 Xi, NWu, YLiao, MFeng, Y Substituted pyrazolone compounds and methods of use US Patent  US8975282 Publication Date 3/10/2015 
Target
Name:
Vascular endothelial growth factor receptor 2
Synonyms:
CD_antigen=CD309 Fetal liver kinase 1 (FLK-1) KDR Protein-tyrosine kinase receptor Flk-1 VEGFR-2 VEGFR2 Vascular Endothelial Growth Factor Receptor Kinase 2 Vascular endothelial growth factor receptor 2 (KDR) Vascular endothelial growth factor receptor 2 (VEGFR2) Vascular endothelial growth factor receptor-2 (VEGFR-2)
Type:
Receptor Tyrosine Kinase
Mol. Mass.:
151510.97
Organism:
Homo sapiens (Human)
Description:
P35968
Residue:
1356
  
Inhibitor
Name:
BDBM149703
Synonyms:
US8975282, 11
Type:
Small organic molecule
Emp. Form.:
C27H24FN5O4
Mol. Mass.:
501.509
SMILES:
Cc1c(C(=O)Nc2ccc(Oc3ccnc(NC(=O)C4CC4)c3)c(F)c2)c(=O)n(-c2ccccc2)n1C
: