Target
Beta-secretase 1
Ligand
BDBM149750
Substrate
Meas. Tech.
Fluorescence Resonance Energy Transfer (FRET) Assay
Ki
117±n/a nM
IC50
154±n/a nM
Citation
 Munakata, RInoue, MTominaga, HYamasaki, SShina, YSamizu, KHamaguchi, HHong, L Chromane compounds US Patent  US8975415 Publication Date 3/10/2015 
Target
Name:
Beta-secretase 1
Synonyms:
ASP2 Aspartyl protease 2 BACE1 Beta-secretase (BACE) Beta-secretase 1 (BACE 1) Beta-secretase 1 (BACE1) Beta-site amyloid precursor protein cleaving enzyme 1 Memapsin-2 beta-Secretase (BACE-1) | beta-Secretase (BACE1)
Type:
Protein
Mol. Mass.:
55755.10
Organism:
Homo sapiens (Human)
Description:
P56817
Residue:
501
  
Inhibitor
Name:
BDBM149750
Synonyms:
US8975415, 28 | US9242973, 28
Type:
Small organic molecule
Emp. Form.:
C21H21FN4O4
Mol. Mass.:
412.4142
SMILES:
CC1(C)Oc2ccc(NC(=O)c3ccc(F)cn3)cc2C2(COC(N)=N2)C11COC1
: