Target
Beta-secretase 1
Ligand
BDBM149914
Substrate
Meas. Tech.
Fluorescence Resonance Energy Transfer (FRET) Assay
Ki
64.5±n/a nM
IC50
109±n/a nM
Citation
 Munakata, RInoue, MTominaga, HYamasaki, SShina, YSamizu, KHamaguchi, HHong, L Chromane compounds US Patent  US8975415 Publication Date 3/10/2015 
Target
Name:
Beta-secretase 1
Synonyms:
ASP2 Aspartyl protease 2 BACE1 Beta-secretase (BACE) Beta-secretase 1 (BACE 1) Beta-secretase 1 (BACE1) Beta-site amyloid precursor protein cleaving enzyme 1 Memapsin-2 beta-Secretase (BACE-1) | beta-Secretase (BACE1)
Type:
Protein
Mol. Mass.:
55755.10
Organism:
Homo sapiens (Human)
Description:
P56817
Residue:
501
  
Inhibitor
Name:
BDBM149914
Synonyms:
US8975415, RP195 | US9242973, 195
Type:
Small organic molecule
Emp. Form.:
C22H23ClN4O4
Mol. Mass.:
442.895
SMILES:
Cc1cc(Cl)cnc1C(=O)Nc1ccc2OC(C)(C)C3(COC3)C3(COC(N)=N3)c2c1
: