Target
CREB-binding protein
Ligand
BDBM150102
Substrate
Meas. Tech.
AlphaScreen In-Vitro Binding Assay
pH
7.5±n/a
Temperature
303.15±n/a K
IC50
630±n/a nM
Comments
extracted
Citation
 Bordas, VCotesta, SGuagnano, VRueeger, HVaupel, A Pyrazolopyrrolidine derivatives and their use in the treatment of disease US Patent  US8975417 Publication Date 3/10/2015 
Target
Name:
CREB-binding protein
Synonyms:
CBP CREB-binding protein (CBP) CREBBP
Type:
Transcription Coactivator
Mol. Mass.:
265411.66
Organism:
Homo sapiens (Human)
Description:
Q92793
Residue:
2442
  
Inhibitor
Name:
BDBM150102
Synonyms:
US8975417, 170
Type:
Small organic molecule
Emp. Form.:
C21H20ClFN4O2
Mol. Mass.:
414.861
SMILES:
CCn1nc(C)c2C(N(C(=O)c12)c1cc(C)c(=O)n(C)c1)c1ccc(Cl)cc1F
: