Target
Non-receptor tyrosine-protein kinase TYK2
Ligand
BDBM281343
Substrate
Meas. Tech.
JAK Caliper Enzyme Assay at 1 mM ATP
pH
7.4±n/a
Temperature
298.15±n/a K
IC50
4.80±n/a nM
Comments
extracted
Citation
 Coe, JWDehnhardt, CMJones, PSabnis, YAStrohbach, JWWakenhut, FMWhitlock, GA Pyrazolopyridines and pyrazolopyrimidines US Patent  US9518052 Publication Date 12/13/2016 
Target
Name:
Non-receptor tyrosine-protein kinase TYK2
Synonyms:
Non-receptor tyrosine-protein kinase TYK2 (TYK2) TYK2_HUMAN | Tyrosine-protein kinase TYK2
Type:
Protein
Mol. Mass.:
133666.03
Organism:
Homo sapiens (Human)
Description:
P29597
Residue:
1187
  
Inhibitor
Name:
BDBM281343
Synonyms:
6-(2-ethyl-5-fluoro-4-hydroxy-phenyl)-N-methyl-4-({2-[meth-yl(methylsulfonyl)ami-no]benzyl}amino)-1H-pyrazolo[4,3-c]pyridine-3-carboxamide | US10022376, Example 19
Type:
Small organic molecule
Emp. Form.:
C25H27FN6O4S
Mol. Mass.:
526.583
SMILES:
CCc1cc(O)c(F)cc1-c1cc2[nH]nc(C(=O)NC)c2c(NCc2ccccc2N(C)S(C)(=O)=O)n1
: