Target
Cytochrome P450 3A4
Ligand
BDBM151199
Substrate
Meas. Tech.
Inhibition Assay
Temperature
310.15±n/a K
IC50
150±n/a nM
Comments
extracted
Citation
 Desai, MCHui, HCLiu, HSun, JXu, L Inhibitors of cytochrome P450 US Patent  US8987313 Publication Date 3/24/2015 
Target
Name:
Cytochrome P450 3A4
Synonyms:
Albendazole monooxygenase CP3A4_HUMAN CYP3A4 CYPIIIA4 Cytochrome P450 3A4 (CYP3A4) Nifedipine oxidase Taurochenodeoxycholate 6-alpha-hydroxylase
Type:
Enzyme
Mol. Mass.:
57349.57
Organism:
Homo sapiens (Human)
Description:
Residue:
503
  
Inhibitor
Name:
BDBM151199
Synonyms:
US8987313, 24
Type:
Small organic molecule
Emp. Form.:
C38H49N7O4S2
Mol. Mass.:
731.97
SMILES:
CC(C)c1nc(CN(C)C(=O)NC2(CCNCC2)C(=O)N[C@H](CC[C@H](Cc2ccccc2)NC(=O)OCc2cncs2)Cc2ccccc2)cs1
: