Target
Transient receptor potential cation channel subfamily M member 8
Ligand
BDBM151678
Substrate
Meas. Tech.
Inhibition Assay
Temperature
310.15±n/a K
IC50
2±n/a nM
Comments
extracted
Citation
 Tsuzuki, YSawamoto, DSakamoto, TKato, TNiwa, YAwai, N Sulfonamide compounds having TRPM8 antagonistic activity US Patent  US8987445 Publication Date 3/24/2015 
Target
Name:
Transient receptor potential cation channel subfamily M member 8
Synonyms:
LTRPC6 TRPM8_HUMAN Transient receptor potential M8 protein (TRPM8) Transient receptor potential cation channel subfamily M member 8 (TRPM8)
Type:
Enzyme
Mol. Mass.:
127693.26
Organism:
Homo sapiens (Human)
Description:
Q7Z2W7
Residue:
1104
  
Inhibitor
Name:
BDBM151678
Synonyms:
US8987445, 106
Type:
Small organic molecule
Emp. Form.:
C25H16F6N2O5S
Mol. Mass.:
570.46
SMILES:
OC(=O)c1ccc(cc1)S(=O)(=O)N(Cc1ccc(OC(F)(F)F)cc1)c1ncc2ccccc2c1C(F)(F)F
: