Target
Solute carrier family 22 member 12
Ligand
BDBM152011
Substrate
Meas. Tech.
Inhibition Assay
IC50
22±n/a nM
Citation
 Nagai, KNagasawa, KTakahashi, HBaba, MFujioka, SKondoh, ETanaka, KItoh, Y Ring-fused compound US Patent  US8987473 Publication Date 3/24/2015 
Target
Name:
Solute carrier family 22 member 12
Synonyms:
OATL4 RST S22AC_HUMAN Solute carrier family 22 member 12 URAT1 Urate anion exchanger 1 (URAT1) | Uric Acid Transporter 1 (URAT1)
Type:
Enzyme
Mol. Mass.:
59638.65
Organism:
Homo sapiens (Human)
Description:
Q96S37
Residue:
553
  
Inhibitor
Name:
BDBM152011
Synonyms:
US8987473, 64
Type:
Small organic molecule
Emp. Form.:
C20H21NO2
Mol. Mass.:
307.3862
SMILES:
Cc1cn(Cc2c(C)cccc2C)c2cc(CC(O)=O)ccc12
: