Target
RAC-alpha serine/threonine-protein kinase
Ligand
BDBM152349
Substrate
Meas. Tech.
Inhibitory Assay
IC50
195±n/a nM
Citation
 Carry, JCertal, VHalley, FKarlsson, KASchio, LThompson, F (6-oxo-1,6-dihydropyrimidin-2-yl)amide derivatives, preparation thereof and pharmaceutical use thereof as AKT(PKB) phosphorylation inhibitors US Patent  US8993565 Publication Date 3/31/2015 
Target
Name:
RAC-alpha serine/threonine-protein kinase
Synonyms:
AKT phosphorylation (p-AKT) AKT1/PPP1CA C-AKT PKB alpha Protein kinase B Protein kinase B (Akt 1) Protein kinase B alpha Proto-oncogene Akt (Akt1) Proto-oncogene c-Akt (AKT1) RAC-PK-alpha RAC-alpha serine/threonine-protein kinase (AKT1) | RAC-alpha serine/threonine-protein kinase (pAKT)
Type:
Enzyme
Mol. Mass.:
55681.25
Organism:
Homo sapiens (Human)
Description:
P31749
Residue:
480
  
Inhibitor
Name:
BDBM152349
Synonyms:
US8993565, 70
Type:
Small organic molecule
Emp. Form.:
C18H21FN4O3
Mol. Mass.:
360.3827
SMILES:
CCn1c(CC(=O)Nc2ccc(F)cc2)nc(cc1=O)N1CCOCC1
: