Target
Acetylcholinesterase
Ligand
BDBM152520
Substrate
Meas. Tech.
In Vitro AChE Inhibition Assay
pH
8±n/a
Ki
2.28e+3± 3.43e+3 nM
IC50
1.39e+3± 2e+1 nM
Km
1520±1270 nM
Comments
extracted
Citation
 Piplani, PDanta, CC Design and synthesis of newer potential 4-(N-acetylamino)phenol derived piperazine derivatives as potential cognition enhancers. Bioorg Chem 60:64-73 (2015)  
Target
Name:
Acetylcholinesterase
Synonyms:
ACES_MOUSE Acetylcholinesterase (mouse AChE) Ache
Type:
Enzyme
Mol. Mass.:
68165.65
Organism:
Mus musculus (mouse)
Description:
Residue:
614
  
Inhibitor
Name:
BDBM152520
Synonyms:
N-[4-{3-(4-phenylpiperazin-1-yl)propoxy}phenyl]acetamide (2b)
Type:
Small organic molecule
Emp. Form.:
C21H27N3O2
Mol. Mass.:
353.458
SMILES:
CC(=O)Nc1ccc(OCCCN2CCN(CC2)c2ccccc2)cc1
: