Target
Carboxylic ester hydrolase
Ligand
BDBM152537
Substrate
Meas. Tech.
Cholinesterase Inhibition Assay
pH
8±n/a
Temperature
298.15±n/a K
IC50
4.286e+4±n/a nM
Comments
extracted
Citation
 Kanhed, AMSinha, AMachhi, JTripathi, AParikh, ZSPillai, PPGiridhar, RYadav, MR Discovery of isoalloxazine derivatives as a new class of potential anti-Alzheimer agents and their synthesis. Bioorg Chem 61:7-12 (2015)  
Target
Name:
Carboxylic ester hydrolase
Synonyms:
BuChE Butyrylcholine esterase Butyrylcholinesterase (BChE) Butyrylcholinesterase (EqBuChE) butyrylcholinesterase precursor
Type:
Protein
Mol. Mass.:
68842.83
Organism:
Equus caballus (Horse)
Description:
Q9N1N9
Residue:
602
  
Inhibitor
Name:
BDBM152537
Synonyms:
10-(3-Methylbenzyl)benzo[g]pteridine-2,4(3H,10H)-dione (7e)
Type:
Small organic molecule
Emp. Form.:
C18H14N4O2
Mol. Mass.:
318.3294
SMILES:
Cc1cccc(Cn2c3ccccc3nc3c2nc(=O)[nH]c3=O)c1
: