Target
Urease [D459Y,K653P]
Ligand
BDBM152597
Substrate
Meas. Tech.
Urease Inhibition Assay
pH
8.2±n/a
IC50
77± 1 nM
Comments
extracted
Citation
 Hameed, AKhan, KMZehra, STAhmed, RShafiq, ZBakht, SMYaqub, MHussain, Mde la Vega de León, AFurtmann, NBajorath, JShad, HATahir, MNIqbal, J Synthesis, biological evaluation and molecular docking of N-phenyl thiosemicarbazones as urease inhibitors. Bioorg Chem 61:51-7 (2015)  
Target
Name:
Urease [D459Y,K653P]
Synonyms:
UREA_CANEN Urease
Type:
Protein
Mol. Mass.:
90763.23
Organism:
Canavalia ensiformis (Jack bean)
Description:
P07374[D459Y,K653P]
Residue:
840
  
Inhibitor
Name:
BDBM152597
Synonyms:
2-(1-(Benzofuran-2-yl)ethylidene)-N-(3-nitrophenyl)hydrazinecarbothioamide (3k)
Type:
Small organic molecule
Emp. Form.:
C17H14N4O3S
Mol. Mass.:
354.383
SMILES:
CC(=NNC(=S)Nc1cccc(c1)[N+]([O-])=O)c1cc2ccccc2o1
: