Target
Genome polyprotein
Ligand
BDBM152639
Substrate
Meas. Tech.
DENV2 Protease Assay
pH
8.5±n/a
IC50
>1.00e+5±n/a nM
Comments
extracted
Citation
 Timiri, AKSelvarasu, SKesherwani, MVijayan, VSinha, BNDevadasan, VJayaprakash, V Synthesis and molecular modelling studies of novel sulphonamide derivatives as dengue virus 2 protease inhibitors. Bioorg Chem 62:74-82 (2015)  
Target
Name:
Genome polyprotein
Synonyms:
DENV2 protease (NS2B-NS3) | POLG_DEN2N
Type:
Protein
Mol. Mass.:
379567.99
Organism:
Dengue virus 2 (Virus)
Description:
P14340
Residue:
3391
  
Inhibitor
Name:
BDBM152639
Synonyms:
4-(1,3-Dioxoisoindolin-2-yl)-N,N-dimethyl benzenesulphonamide (2)
Type:
Small organic molecule
Emp. Form.:
C16H14N2O4S
Mol. Mass.:
330.358
SMILES:
CN(C)S(=O)(=O)c1ccc(cc1)N1C(=O)c2ccccc2C1=O
: