Target
Acetylpolyamine amidohydrolase
Ligand
BDBM152729
Substrate
Meas. Tech.
APAH Fluorimetric Assay
pH
8.2±n/a
IC50
1.3e+2± 1e+1 nM
Comments
extracted
Citation
 Decroos, CChristianson, DW Design, Synthesis, and Evaluation of Polyamine Deacetylase Inhibitors, and High-Resolution Crystal Structures of Their Complexes with Acetylpolyamine Amidohydrolase. Biochemistry 54:4692-703 (2015)  
Target
Name:
Acetylpolyamine amidohydrolase
Synonyms:
APAH_MYCRA Acetylpolyamine aminohydrolase aphA
Type:
Protein
Mol. Mass.:
36324.64
Organism:
Mycoplana ramosa (Gram-negative bacterium)
Description:
Residue:
341
  
Inhibitor
Name:
BDBM152729
Synonyms:
6-Amino-N-hydroxypentanamide (5)
Type:
Small organic molecule
Emp. Form.:
C6H15N2O2
Mol. Mass.:
147.195
SMILES:
[NH3+]CCCCCC(=O)NO
: