Target
Acetyl-CoA carboxylase 1
Ligand
BDBM152911
Substrate
Meas. Tech.
Inhibition Assay
pH
7.5±n/a
IC50
6.1±n/a nM
Comments
extracted
Citation
 Griffith, DADow, RLBagley, SWSmith, A N1/N2-lactam acetyl-CoA carboxylase inhibitors US Patent  US8993586 Publication Date 3/31/2015 
Target
Name:
Acetyl-CoA carboxylase 1
Synonyms:
ACAC ACACA_HUMAN ACC1 Acetyl-CoA carboxylase 1 | Acetyl-CoA carboxylase 1 (ACC1)
Type:
Protein
Mol. Mass.:
265543.22
Organism:
Homo sapiens (Human)
Description:
Q13085
Residue:
2346
  
Inhibitor
Name:
BDBM152911
Synonyms:
US8993586, 107
Type:
Small organic molecule
Emp. Form.:
C27H34N6O2
Mol. Mass.:
474.5979
SMILES:
CC(C)Nc1ccc2ccc(cc2n1)C(=O)N1CCC2(CC1)Cc1cn(nc1C(=O)N2)C(C)(C)C
: