Target
Acetyl-CoA carboxylase 2
Ligand
BDBM152870
Substrate
Meas. Tech.
Inhibition Assay
IC50
9.2±n/a nM
Citation
 Griffith, DADow, RLBagley, SWSmith, A N1/N2-lactam acetyl-CoA carboxylase inhibitors US Patent  US8993586 Publication Date 3/31/2015 
Target
Name:
Acetyl-CoA carboxylase 2
Synonyms:
ACACB ACC-beta ACCB Acetyl-CoA carboxylase 2 Acetyl-CoA carboxylase 2 (ACC2)
Type:
Protein
Mol. Mass.:
276535.21
Organism:
Homo sapiens (Human)
Description:
O00763
Residue:
2458
  
Inhibitor
Name:
BDBM152870
Synonyms:
US8993586, 48
Type:
Small organic molecule
Emp. Form.:
C25H29N5O3
Mol. Mass.:
447.5295
SMILES:
COc1ccc2ncc(cc2c1)C(=O)N1CCC2(CC1)Cc1cn(nc1C(=O)N2)C(C)(C)C
: