Target
Calcium release-activated calcium channel protein 1
Ligand
BDBM152939
Substrate
Meas. Tech.
Inhibition Assay
Temperature
310.15±n/a K
IC50
160.5±n/a nM
Comments
extracted
Citation
 Muthuppalaniappan, MViswanadha, SVaranasi, KVMerikapudi, GSVakkalanka, SK Modulators of calcium release-activated calcium channel and methods for treatment of non-small cell lung cancer US Patent  US8993612 Publication Date 3/31/2015 
Target
Name:
Calcium release-activated calcium channel protein 1
Synonyms:
CRACM1 Calcium channel (VER) Calcium release-activated calcium channel protein 1 Protein orai-1 Transmembrane protein 142A
Type:
Protein
Mol. Mass.:
32676.63
Organism:
Homo sapiens (Human)
Description:
Q96D31
Residue:
301
  
Inhibitor
Name:
BDBM152939
Synonyms:
US8993612, 30
Type:
Small organic molecule
Emp. Form.:
C21H16F4N6O
Mol. Mass.:
444.385
SMILES:
Fc1cc(NC(=O)Cn2nnc3ccccc23)ccc1-n1nc(cc1C1CC1)C(F)(F)F
: