Target
E3 ubiquitin-protein ligase Mdm2
Ligand
BDBM152962
Substrate
Meas. Tech.
Homogeneous Time-Resolved Fluorescence (HTRF) Assay
IC50
11±n/a nM
Citation
 Bartkovitz, DJChu, XVu, BTZhao, CFishlock, D Substituted pyrrolidine-2-carboxamides US Patent  US8993614 Publication Date 3/31/2015 
Target
Name:
E3 ubiquitin-protein ligase Mdm2
Synonyms:
Double minute 2 protein E3 ubiquitin-protein ligase Mdm2 (p53-binding protein Mdm2) Human Double Minute 2 (HDM2) MDM2-MDMX p53-Binding Protein MDM2 | p53-binding protein
Type:
Oncoprotein
Mol. Mass.:
55196.54
Organism:
Homo sapiens (Human)
Description:
Q00987
Residue:
491
  
Inhibitor
Name:
BDBM152962
Synonyms:
US8993614, 23
Type:
Small organic molecule
Emp. Form.:
C43H42Cl2F2N4O8
Mol. Mass.:
851.718
SMILES:
COc1cc(ccc1NC(=O)[C@@H]1N[C@@H](CC(C)(C)C)[C@@](C#N)([C@H]1c1cccc(Cl)c1F)c1ccc(Cl)cc1F)C(=O)OC(C)OC(=O)NCC(=O)OCc1ccccc1
: