Target
Lysine-specific histone demethylase 1A
Ligand
BDBM153271
Substrate
Meas. Tech.
In vitro LSD1 Inhibition Assay
pH
7.5±n/a
Temperature
298.15±n/a K
IC50
2.41e+3±n/a nM
Comments
extracted
Citation
 Zhou, CKang, DXu, YZhang, LZha, X Identification of Novel Selective Lysine-Specific Demethylase 1 (LSD1) Inhibitors Using a Pharmacophore-Based Virtual Screening Combined with Docking. Chem Biol Drug Des 85:659-71 (2015)  
Target
Name:
Lysine-specific histone demethylase 1A
Synonyms:
AOF2 Flavin-containing amine oxidase domain-containing protein 2 KDM1A KIAA0601 Lysine-specific demethylase 1 (LSD1) Lysine-specific histone demethylase 1 (LSD1)
Type:
Enzyme
Mol. Mass.:
92901.01
Organism:
Homo sapiens (Human)
Description:
O60341
Residue:
852
  
Inhibitor
Name:
BDBM153271
Synonyms:
XZ09
Type:
Small organic molecule
Emp. Form.:
C25H22ClNO4
Mol. Mass.:
435.899
SMILES:
Cc1ccc(NC(=O)CCC(=O)OCC(=O)c2ccc(cc2)-c2ccccc2)cc1Cl
: