Target
Fatty acid-binding protein, intestinal
Ligand
BDBM60927
Substrate
Meas. Tech.
ITC Titration
pH
8±0
Temperature
310.15±0 K
Kd
1.33e+4± 3.04e+3 nM
Citation
 Patil, RLaguerre, AWielens, JHeadey, SJWilliams, MLHughes, MLMohanty, BPorter, CJScanlon, MJ Characterization of two distinct modes of drug binding to human intestinal fatty acid binding protein. ACS Chem Biol 9:2526-34 (2014)  
Target
Name:
Fatty acid-binding protein, intestinal
Synonyms:
FABP2 FABPI_HUMAN Fatty acid-binding protein, intestinal Intestinal fatty acid-binding protein (hIFABP)
Type:
Protein
Mol. Mass.:
15207.56
Organism:
Homo sapiens (Human)
Description:
Residue:
132
  
Inhibitor
Name:
BDBM60927
Synonyms:
1-anilinonaphthalene-8-sulfonic acid ANS BDBM50126831
Type:
Emp. Form.:
C16H13NO3S
Mol. Mass.:
299.344
SMILES:
OS(=O)(=O)c1cccc2cccc(Nc3ccccc3)c12
: