Target
Decaprenyl diphosphate synthase
Ligand
BDBM153338
Substrate
Meas. Tech.
DPPS Inhibition (GPP based) Assay
pH
7.5±n/a
IC50
2.0e+4±n/a nM
Comments
extracted
Citation
 Kim, MOFeng, XFeixas, FZhu, WLindert, SBogue, SSinko, Wde Oliveira, CRao, GOldfield, EMcCammon, JA A Molecular Dynamics Investigation of Mycobacterium tuberculosis Prenyl Synthases: Conformational Flexibility and Implications for Computer-aided Drug Discovery. Chem Biol Drug Des 85:756-69 (2015)  
Target
Name:
Decaprenyl diphosphate synthase
Synonyms:
DPDS_MYCTO uppS
Type:
Protein
Mol. Mass.:
33800.02
Organism:
Mycobacterium tuberculosis H37Rv
Description:
Residue:
296
  
Inhibitor
Name:
BDBM153338
Synonyms:
BPH-1330
Type:
Small organic molecule
Emp. Form.:
C18H24O5
Mol. Mass.:
320.3802
SMILES:
CCCCCCCCOc1ccc(cc1)C(=O)\C=C(/O)C(O)=O
: