Target
Polyunsaturated fatty acid lipoxygenase ALOX15B
Ligand
BDBM50222284
Substrate
Meas. Tech.
IC50 Assay
pH
7.3±n/a
Temperature
298.15±n/a K
IC50
>1.00e+5±n/a nM
Comments
extracted
Citation
 Mascayano, CEspinosa, VSepúlveda-Boza, SHoobler, EKPerry, SDiaz, GHolman, TR Enzymatic Studies of Isoflavonoids as Selective and Potent Inhibitors of Human Leukocyte 5-Lipo-Oxygenase. Chem Biol Drug Des 86:114-21 (2015)  
Target
Name:
Polyunsaturated fatty acid lipoxygenase ALOX15B
Synonyms:
15-LOX-2 15-Lipoxygenase-2 (15-LOX-2) ALOX15B Arachidonate 15-lipoxygenase, type II Epithelial 15-lipoxygenase-2 | LX15B_HUMAN
Type:
Protein
Mol. Mass.:
75850.40
Organism:
Homo sapiens (Human)
Description:
Residue:
676
  
Inhibitor
Name:
BDBM50222284
Synonyms:
7,8-dihydroxy-3'-methylisoflavone IR-309
Type:
Small organic molecule
Emp. Form.:
C16H12O4
Mol. Mass.:
268.2641
SMILES:
Cc1cccc(c1)-c1coc2c(O)c(O)ccc2c1=O
: