Target
Polyunsaturated fatty acid lipoxygenase ALOX15B
Ligand
BDBM50139862
Substrate
Meas. Tech.
IC50 Assay
pH
7.3±n/a
Temperature
298.15±n/a K
IC50
7.1e+4± 3.0e+4 nM
Comments
extracted
Citation
 Mascayano, CEspinosa, VSepúlveda-Boza, SHoobler, EKPerry, SDiaz, GHolman, TR Enzymatic Studies of Isoflavonoids as Selective and Potent Inhibitors of Human Leukocyte 5-Lipo-Oxygenase. Chem Biol Drug Des 86:114-21 (2015)  
Target
Name:
Polyunsaturated fatty acid lipoxygenase ALOX15B
Synonyms:
15-LOX-2 15-Lipoxygenase-2 (15-LOX-2) ALOX15B Arachidonate 15-lipoxygenase, type II Epithelial 15-lipoxygenase-2 | LX15B_HUMAN
Type:
Protein
Mol. Mass.:
75850.40
Organism:
Homo sapiens (Human)
Description:
Residue:
676
  
Inhibitor
Name:
BDBM50139862
Synonyms:
3-(4-Hydroxy-phenyl)-chroman-6,7-diol CHEMBL8328 | HIR-1
Type:
Small organic molecule
Emp. Form.:
C15H14O4
Mol. Mass.:
258.2693
SMILES:
Oc1ccc(cc1)C1COc2cc(O)c(O)cc2C1
: