Target
Beta-secretase 1
Ligand
BDBM153630
Substrate
Meas. Tech.
Inhitbition Assay
pH
5±n/a
Temperature
303.15±n/a K
IC50
<30000±n/a nM
Comments
extracted
Citation
 Masui, MHori, A Oxazine derivatives US Patent  US8999980 Publication Date 4/7/2015 
Target
Name:
Beta-secretase 1
Synonyms:
ASP2 Aspartyl protease 2 BACE1 Beta-secretase (BACE) Beta-secretase 1 (BACE 1) Beta-secretase 1 (BACE1) Beta-site amyloid precursor protein cleaving enzyme 1 Memapsin-2 beta-Secretase (BACE-1) | beta-Secretase (BACE1)
Type:
Protein
Mol. Mass.:
55755.10
Organism:
Homo sapiens (Human)
Description:
P56817
Residue:
501
  
Inhibitor
Name:
BDBM153630
Synonyms:
US8999980, I-10
Type:
Small organic molecule
Emp. Form.:
C17H18FN5O3
Mol. Mass.:
359.3549
SMILES:
COc1cnc(cn1)C(=O)Nc1ccc(F)c(c1)[C@]1(C)CCOC(N)=N1
: