Target
Sodium channel protein type 9 subunit alpha
Ligand
BDBM154021
Substrate
Meas. Tech.
In Vitro Assay
IC50
1800±n/a nM
Citation
 Boezio, CBregman, HCoats, JRDimauro, EFDineen, TDu, BGraceffa, RKreiman, CLa, DMarx, IEChakka, NNguyen, HNPeterson, EAWeiss, MCopeland, KWDeak, HLBoezio, A Bicyclic aryl and heteroaryl sodium channel inhibitors US Patent  US9012443 Publication Date 4/21/2015 
Target
Name:
Sodium channel protein type 9 subunit alpha
Synonyms:
NENA Peripheral sodium channel 1 SCN9A_HUMAN Voltage-gated sodium channel subunit Nav1.7 hNE-Na
Type:
Protein
Mol. Mass.:
226375.97
Organism:
Homo sapiens (Human)
Description:
Q15858
Residue:
1988
  
Inhibitor
Name:
BDBM154021
Synonyms:
US9012443, 14 (isomer 1) US9012443, 14 (mixture of isomers)
Type:
Small organic molecule
Emp. Form.:
C22H20N4O3S2
Mol. Mass.:
452.549
SMILES:
O=S(=O)(Nc1ncns1)c1ccc2c(cccc2c1)N1CCOC(C1)c1ccccc1
: