Target
Sodium channel protein type 9 subunit alpha
Ligand
BDBM154153
Substrate
Meas. Tech.
In Vitro Assay
IC50
20±n/a nM
Citation
 Boezio, CBregman, HCoats, JRDimauro, EFDineen, TDu, BGraceffa, RKreiman, CLa, DMarx, IEChakka, NNguyen, HNPeterson, EAWeiss, MCopeland, KWDeak, HLBoezio, A Bicyclic aryl and heteroaryl sodium channel inhibitors US Patent  US9012443 Publication Date 4/21/2015 
Target
Name:
Sodium channel protein type 9 subunit alpha
Synonyms:
NENA Peripheral sodium channel 1 SCN9A_HUMAN Voltage-gated sodium channel subunit Nav1.7 hNE-Na
Type:
Protein
Mol. Mass.:
226375.97
Organism:
Homo sapiens (Human)
Description:
Q15858
Residue:
1988
  
Inhibitor
Name:
BDBM154153
Synonyms:
US9012443, 161
Type:
Small organic molecule
Emp. Form.:
C20H14Cl2N4O3S
Mol. Mass.:
461.321
SMILES:
COc1cc(Cl)c(Cl)cc1-c1nccc2cc(ccc12)S(=O)(=O)Nc1ccncn1
: