Target
Sodium channel protein type 9 subunit alpha
Ligand
BDBM154212
Substrate
Meas. Tech.
In Vitro Assay
IC50
30±n/a nM
Citation
 Boezio, CBregman, HCoats, JRDimauro, EFDineen, TDu, BGraceffa, RKreiman, CLa, DMarx, IEChakka, NNguyen, HNPeterson, EAWeiss, MCopeland, KWDeak, HLBoezio, A Bicyclic aryl and heteroaryl sodium channel inhibitors US Patent  US9012443 Publication Date 4/21/2015 
Target
Name:
Sodium channel protein type 9 subunit alpha
Synonyms:
NENA Peripheral sodium channel 1 SCN9A_HUMAN Voltage-gated sodium channel subunit Nav1.7 hNE-Na
Type:
Protein
Mol. Mass.:
226375.97
Organism:
Homo sapiens (Human)
Description:
Q15858
Residue:
1988
  
Inhibitor
Name:
BDBM154212
Synonyms:
US9012443, 225
Type:
Small organic molecule
Emp. Form.:
C21H16F3N3O3S2
Mol. Mass.:
479.495
SMILES:
COCc1cc(ccc1-c1nccc2cc(ccc12)S(=O)(=O)Nc1nccs1)C(F)(F)F
: